Reaction Details
TargetGalactokinase
LigandBDBM249789
Substrate/Competitorn/a
Meas. Tech.qHTS Assay
IC50 595.1±n/a nM
Citation Boxer, MBWalsh, MJLiu, LTanega, CDShen, MLai, KTang, MAuld, DS Galactokinase inhibitors for the treatment and prevention of associated diseases and disorders US Patent US9447087 Publication Date 9/20/2016
 
Galactokinase
Name:Galactokinase
Type:Enzyme
Mol. Mass.:42271.26
Organism:Homo sapiens (Human)
Description:P51570
Residue:392
BDBM249789
NameBDBM249789
Synonyms:US9447087, 17 | US9447087, 57
TypeSmall organic molecule
Emp. Form.C21H17ClN4O2
Mol. Mass.392.838
SMILESClc1ccccc1C1N=C(Nc2nc3ccccc3o2)NC2=C1C(=O)CCC2