Reaction Details
TargetCoagulation factor XI
LigandBDBM238263
Substrate/Competitorn/a
Meas. Tech.Factor XIa Enzyme Assay
IC50 5.40±n/a nM
Citation Imagawa, AKondo, TNishiyama, TCourtney, SYarnold, CIchihara, OFlanagan, S Substituted pyrrolidines as factor XIa inhibitors for the treatment thromboembolic diseases US Patent US9585881 Publication Date 3/7/2017
 
Coagulation factor XI
Name:Coagulation factor XI
Type:Enzyme
Mol. Mass.:70130.58
Organism:Homo sapiens (Human)
Description:P03951
Residue:625
BDBM238263
NameBDBM238263
Synonyms:US10336741, Example 88 US9394250, 88 | US9585881, Example 88
TypeSmall organic molecule
Emp. Form.C27H38ClN9O5S
Mol. Mass.636.166
SMILESCOC(=O)Nc1ccc(cc1)-c1[nH]c(nc1Cl)[C@@H]1C[C@@H](CN1C(=O)N1CCN(CC1)C(N)=N)C1CCN(CC1)S(C)(=O)=O