Reaction Details
TargetProthrombin
LigandBDBM238263
Substrate/Competitorn/a
Meas. Tech.Factor Xa and Thrombin Enzyme Assay
IC50 57000±n/a nM
Citation Imagawa, AKondo, TNishiyama, TCourtney, SYarnold, CIchihara, OFlanagan, S Substituted pyrrolidines as factor XIa inhibitors for the treatment thromboembolic diseases US Patent US9585881 Publication Date 3/7/2017
 
Prothrombin
Name:Prothrombin
Type:Protein
Mol. Mass.:70029.57
Organism:Homo sapiens (Human)
Description:P00734
Residue:622
BDBM238263
NameBDBM238263
Synonyms:US10336741, Example 88 US9394250, 88 | US9585881, Example 88
TypeSmall organic molecule
Emp. Form.C27H38ClN9O5S
Mol. Mass.636.166
SMILESCOC(=O)Nc1ccc(cc1)-c1[nH]c(nc1Cl)[C@@H]1C[C@@H](CN1C(=O)N1CCN(CC1)C(N)=N)C1CCN(CC1)S(C)(=O)=O