Reaction Details
TargetCoagulation factor XI
LigandBDBM238265
Substrate/Competitorn/a
Meas. Tech.Factor XIa Enzyme Assay
IC50 5.40±n/a nM
Citation Imagawa, AKondo, TNishiyama, TCourtney, SYarnold, CIchihara, OFlanagan, S Substituted pyrrolidines as factor XIa inhibitors for the treatment thromboembolic diseases US Patent US9585881 Publication Date 3/7/2017
 
Coagulation factor XI
Name:Coagulation factor XI
Type:Enzyme
Mol. Mass.:70130.58
Organism:Homo sapiens (Human)
Description:P03951
Residue:625
BDBM238265
NameBDBM238265
Synonyms:US10336741, Example 94 US9394250, 94 | US9585881, Example 94
TypeSmall organic molecule
Emp. Form.C31H33Cl2N9O5S
Mol. Mass.714.622
SMILESCOC(=O)Nc1ccc(cc1)-c1[nH]c(nc1Cl)[C@@H]1C[C@@H](CN1C(=O)\C=C\c1cc(Cl)ccc1-n1cnnn1)C1CCN(CC1)S(C)(=O)=O