Reaction Details
TargetTrace amine-associated receptor 1
LigandBDBM250215
Substrate/Competitorn/a
Meas. Tech.Radioligand Binding Assay
pH7.4±n/a
Temperature310.15±n/a K
Ki 0.3±n/a nM
Commentsextracted
Citation Groebke Zbinden, KNorcross, RPflieger, P Substituted benzamides US Patent US9452980 Publication Date 9/27/2016
 
Trace amine-associated receptor 1
Name:Trace amine-associated receptor 1
Type:Protein
Mol. Mass.:37635.41
Organism:Mus musculus (Mouse)
Description:Q923Y8
Residue:332
BDBM250215
NameBDBM250215
Synonyms:US10501411, Example 125 US9452980, 125
TypeSmall organic molecule
Emp. Form.C20H21F3N2O3
Mol. Mass.394.3875
SMILESFC(F)(F)Oc1ccc(CCOC(=O)Nc2ccc(cc2)C2CCNC2)cc1