Reaction Details
TargetHematopoietic prostaglandin D synthase
LigandBDBM250508
Substrate/Competitorn/a
Meas. Tech.Enzyme Immunoassay (EIA) Assay
pH7.4±n/a
IC50 26±n/a nM
Commentsextracted
Citation Vandeusen, CLWeiberth, FJGill, HSLee, GHillegass, A Phenyloxadiazole derivatives as PGDS inhibitors US Patent US9469627 Publication Date 10/18/2016
 
Hematopoietic prostaglandin D synthase
Name:Hematopoietic prostaglandin D synthase
Type:Enzyme
Mol. Mass.:23341.07
Organism:Homo sapiens (Human)
Description:The protein was expressed in E. coli strain BL21(DE3) with an N-terminal 6-His tag.
Residue:199
BDBM250508
NameBDBM250508
Synonyms:US9469627, 3
TypeSmall organic molecule
Emp. Form.C23H22N6O3
Mol. Mass.430.4592
SMILESC[C@@H](NC(=O)c1cnc(nc1)-c1ccccn1)c1cccc(c1)-c1noc(n1)C(C)(C)O