Reaction Details
TargetAlpha-carbonic anhydrase
LigandBDBM50344898
Substrate/Competitorn/a
Meas. Tech.ChEMBL_158306 (CHEMBL763191)
pH7.5±n/a
Temperature293.15±n/a K
Ki 360000±n/a nM
Citation Del Prete, SVullo, DDe Luca, VCarginale, Vdi Fonzo, POsman, SMAlOthman, ZSupuran, CTCapasso, C Anion inhibition profiles of a-, ß- and ¿-carbonic anhydrases from the pathogenic bacterium Vibrio cholerae. Bioorg Med Chem24:3413-7 (2016) 
 
Alpha-carbonic anhydrase
Name:Alpha-carbonic anhydrase
Synonyms:hpαCA
Type:Protein
Mol. Mass.:28337.60
Organism:Helicobacter pylori (strain G27)
Description:B5Z8I0
Residue:247
BDBM50344898
NameBDBM50344898
TypeSmall organic molecule
Emp. Form.O4Ru
Mol. Mass.165.07
SMILESO=[Ru-](=O)(=O)=O