Reaction Details
TargetAlpha-carbonic anhydrase
LigandBDBM50278323
Substrate/Competitorn/a
Meas. Tech.ChEMBL_158306 (CHEMBL763191)
pH7.5±n/a
Temperature293.15±n/a K
Ki 380000±n/a nM
Citation Del Prete, SVullo, DDe Luca, VCarginale, Vdi Fonzo, POsman, SMAlOthman, ZSupuran, CTCapasso, C Anion inhibition profiles of a-, ß- and ¿-carbonic anhydrases from the pathogenic bacterium Vibrio cholerae. Bioorg Med Chem24:3413-7 (2016) 
 
Alpha-carbonic anhydrase
Name:Alpha-carbonic anhydrase
Synonyms:hpαCA
Type:Protein
Mol. Mass.:28337.60
Organism:Helicobacter pylori (strain G27)
Description:B5Z8I0
Residue:247
BDBM50278323
NameBDBM50278323
TypeSmall organic molecule
Emp. Form.CS3
Mol. Mass.108.207
SMILES[S-]C([S-])=S