Reaction Details
TargetCarbonic anhydrase
LigandBDBM26988
Substrate/Competitorn/a
Meas. Tech.ChEMBL_158307 (CHEMBL763192)
pH7.5±n/a
Temperature293.15±n/a K
Ki 670000±n/a nM
Citation Del Prete, SVullo, DDe Luca, VCarginale, Vdi Fonzo, POsman, SMAlOthman, ZSupuran, CTCapasso, C Anion inhibition profiles of a-, ß- and ¿-carbonic anhydrases from the pathogenic bacterium Vibrio cholerae. Bioorg Med Chem24:3413-7 (2016) 
 
Carbonic anhydrase
Name:Carbonic anhydrase
Synonyms:VchCA
Type:Protein
Mol. Mass.:26434.13
Organism:Vibrio cholerae serotype O1 (strain ATCC 39315 / El Tor Inaba N16961)
Description:Q9KMP6
Residue:239
BDBM26988
NameBDBM26988
TypeIon
Emp. Form.NO3
Mol. Mass.62.0054
SMILES[O-][N+]([O-])=O