Reaction Details
TargetMelanocyte-stimulating hormone receptor
LigandBDBM250673
Substrate/Competitorn/a
Meas. Tech.Competitive Inhibition Binding Assay
pH7.5±n/a
Temperature310.15±n/a K
Ki 0.015±n/a nM
Commentsextracted
Citation Yang, WShi, Y Melanocortin-1 receptor-specific cyclic peptides US Patent US9447148 Publication Date 9/20/2016
 
Melanocyte-stimulating hormone receptor
Name:Melanocyte-stimulating hormone receptor
Type:Enzyme
Mol. Mass.:34717.23
Organism:Homo sapiens (Human)
Description:Q01726
Residue:317
BDBM250673
NameBDBM250673
Synonyms:US9447148, 9.42 | US9447148, 9.55
TypeSmall organic molecule
Emp. Form.C48H70N14O9
Mol. Mass.987.1578
SMILESCCCC[C@H](NC(C)=O)C(=O)N[C@H]1CCC(=O)NCC[C@H](NC(=O)[C@H](CCCNC(N)=N)NC(=O)[C@@H](Cc2ccccc2)NC(=O)[C@H](CCCN)NC1=O)C(=O)N[C@@H](Cc1c[nH]c2ccccc12)C(N)=O