Reaction Details
TargetSerine/threonine-protein kinase mTOR [1360-2549]
LigandBDBM251605
Substrate/Competitorn/a
Meas. Tech.LanthaScreen Kinase Activity Assay
pH7.5±n/a
Temperature298.15±n/a K
IC50 785±n/a nM
Commentsextracted
Citation Pastor Fernández, JFernández-Capetillo Ruiz, OMartínez González, SBlanco Aparicio, CRico Ferreira, MToledo Lázaro, LIRodríguez Arísteguí, SMurga Costa, MVarela Busto, CLopez Contreras, AJRenner, ONieto Soler, MCebrián Muñoz, DA Chemical entities US Patent US9453031 Publication Date 9/27/2016
 
Serine/threonine-protein kinase mTOR [1360-2549]
Name:Serine/threonine-protein kinase mTOR [1360-2549]
Type:Enzyme
Mol. Mass.:136306.16
Organism:Homo sapiens (Human)
Description:aa 1360-2549
Residue:1190
BDBM251605
NameBDBM251605
Synonyms:US9453031, 28
TypeSmall organic molecule
Emp. Form.C23H25FN4O5S
Mol. Mass.488.532
SMILESCS(=O)(=O)C1(CCOCC1)c1nc(nc2N3CCOC[C@H]3COc12)-c1cc(F)cc2[nH]ccc12