Reaction Details
TargetSerine/threonine-protein kinase mTOR [1360-2549]
LigandBDBM251630
Substrate/Competitorn/a
Meas. Tech.LanthaScreen Kinase Activity Assay
pH7.5±n/a
Temperature298.15±n/a K
IC50 151±n/a nM
Commentsextracted
Citation Pastor Fernández, JFernández-Capetillo Ruiz, OMartínez González, SBlanco Aparicio, CRico Ferreira, MToledo Lázaro, LIRodríguez Arísteguí, SMurga Costa, MVarela Busto, CLopez Contreras, AJRenner, ONieto Soler, MCebrián Muñoz, DA Chemical entities US Patent US9453031 Publication Date 9/27/2016
 
Serine/threonine-protein kinase mTOR [1360-2549]
Name:Serine/threonine-protein kinase mTOR [1360-2549]
Type:Enzyme
Mol. Mass.:136306.16
Organism:Homo sapiens (Human)
Description:aa 1360-2549
Residue:1190
BDBM251630
NameBDBM251630
Synonyms:US9453031, 67
TypeSmall organic molecule
Emp. Form.C22H24N4O4S
Mol. Mass.440.515
SMILESCS(=O)(=O)C1(CCC1)c1nc(nc2N3CCOC[C@H]3COc12)-c1cccc2[nH]ccc12