Reaction Details
TargetSerine/threonine-protein kinase mTOR [1360-2549]
LigandBDBM251656
Substrate/Competitorn/a
Meas. Tech.LanthaScreen Kinase Activity Assay
pH7.5±n/a
Temperature298.15±n/a K
IC50 224±n/a nM
Commentsextracted
Citation Pastor Fernández, JFernández-Capetillo Ruiz, OMartínez González, SBlanco Aparicio, CRico Ferreira, MToledo Lázaro, LIRodríguez Arísteguí, SMurga Costa, MVarela Busto, CLopez Contreras, AJRenner, ONieto Soler, MCebrián Muñoz, DA Chemical entities US Patent US9453031 Publication Date 9/27/2016
 
Serine/threonine-protein kinase mTOR [1360-2549]
Name:Serine/threonine-protein kinase mTOR [1360-2549]
Type:Enzyme
Mol. Mass.:136306.16
Organism:Homo sapiens (Human)
Description:aa 1360-2549
Residue:1190
BDBM251656
NameBDBM251656
Synonyms:US9453031, 109
TypeSmall organic molecule
Emp. Form.C22H24N4O4S
Mol. Mass.440.515
SMILESCc1cc2c(cccc2[nH]1)-c1nc2N3CCOC[C@H]3COc2c(n1)C1(CC1)S(C)(=O)=O