Reaction Details
TargetDNA-dependent protein kinase catalytic subunit
LigandBDBM251634
Substrate/Competitorn/a
Meas. Tech.ADP Hunter Plus Assay
pH7.5±n/a
Temperature310.15±n/a K
IC50 10000±n/a nM
Commentsextracted
Citation Pastor Fernández, JFernández-Capetillo Ruiz, OMartínez González, SBlanco Aparicio, CRico Ferreira, MToledo Lázaro, LIRodríguez Arísteguí, SMurga Costa, MVarela Busto, CLopez Contreras, AJRenner, ONieto Soler, MCebrián Muñoz, DA Chemical entities US Patent US9453031 Publication Date 9/27/2016
 
DNA-dependent protein kinase catalytic subunit
Name:DNA-dependent protein kinase catalytic subunit
Type:Protein
Mol. Mass.:469114.78
Organism:Homo sapiens (Human)
Description:P78527
Residue:4128
BDBM251634
NameBDBM251634
Synonyms:US9453031, 71
TypeSmall organic molecule
Emp. Form.C21H23FN4O4S
Mol. Mass.446.495
SMILESCC(C)(c1nc(nc2N3CCOC[C@H]3COc12)-c1cc(F)cc2[nH]ccc12)S(C)(=O)=O