Reaction Details
TargetLysophosphatidic acid receptor 5
LigandBDBM251670
Substrate/Competitorn/a
Meas. Tech.Receptor Assay
Temperature310.15±n/a K
IC50 24±n/a nM
Commentsextracted
Citation Buffham, WCanning, HDavenport, RFarnaby, WMack, SParmar, AWright, S Compounds US Patent US9464060 Publication Date 10/11/2016
 
Lysophosphatidic acid receptor 5
Name:Lysophosphatidic acid receptor 5
Type:Enzyme
Mol. Mass.:41372.36
Organism:Homo sapiens (Human)
Description:Q9H1C0
Residue:372
BDBM251670
NameBDBM251670
Synonyms:US10100018, Example 6 | US9464060, 6
TypeSmall organic molecule
Emp. Form.C26H24FNO4
Mol. Mass.433.4715
SMILESOC(=O)c1ccc(CN(CC2CCC2)C(=O)c2ccc(Oc3ccccc3F)cc2)cc1