Reaction Details
TargetLysophosphatidic acid receptor 5
LigandBDBM251697
Substrate/Competitorn/a
Meas. Tech.Receptor Assay
Temperature310.15±n/a K
IC50 0.4±n/a nM
Commentsextracted
Citation Buffham, WCanning, HDavenport, RFarnaby, WMack, SParmar, AWright, S Compounds US Patent US9464060 Publication Date 10/11/2016
 
Lysophosphatidic acid receptor 5
Name:Lysophosphatidic acid receptor 5
Type:Enzyme
Mol. Mass.:41372.36
Organism:Homo sapiens (Human)
Description:Q9H1C0
Residue:372
BDBM251697
NameBDBM251697
Synonyms:US10100018, Example 33 | US9464060, 33
TypeSmall organic molecule
Emp. Form.C31H28FNO5
Mol. Mass.513.5561
SMILESCOc1ccccc1Oc1ccc(cc1)C(=O)N(CCCc1cccc(F)c1)Cc1ccc(cc1)C(O)=O