Reaction Details
TargetLysophosphatidic acid receptor 5
LigandBDBM251718
Substrate/Competitorn/a
Meas. Tech.Receptor Assay
Temperature310.15±n/a K
IC50 26±n/a nM
Commentsextracted
Citation Buffham, WCanning, HDavenport, RFarnaby, WMack, SParmar, AWright, S Compounds US Patent US9464060 Publication Date 10/11/2016
 
Lysophosphatidic acid receptor 5
Name:Lysophosphatidic acid receptor 5
Type:Enzyme
Mol. Mass.:41372.36
Organism:Homo sapiens (Human)
Description:Q9H1C0
Residue:372
BDBM251718
NameBDBM251718
Synonyms:US10100018, Example 54 | US9464060, 54
TypeSmall organic molecule
Emp. Form.C25H21F2NO4
Mol. Mass.437.4353
SMILESOC(=O)c1ccc(CN(CC2CC2)C(=O)c2ccc(Oc3ccccc3F)cc2F)cc1