Reaction Details
TargetLysophosphatidic acid receptor 5
LigandBDBM251723
Substrate/Competitorn/a
Meas. Tech.Receptor Assay
Temperature310.15±n/a K
IC50 6±n/a nM
Commentsextracted
Citation Buffham, WCanning, HDavenport, RFarnaby, WMack, SParmar, AWright, S Compounds US Patent US9464060 Publication Date 10/11/2016
 
Lysophosphatidic acid receptor 5
Name:Lysophosphatidic acid receptor 5
Type:Enzyme
Mol. Mass.:41372.36
Organism:Homo sapiens (Human)
Description:Q9H1C0
Residue:372
BDBM251723
NameBDBM251723
Synonyms:US10100018, Example 59 | US9464060, 59
TypeSmall organic molecule
Emp. Form.C29H23F2NO5
Mol. Mass.503.4934
SMILESCOc1cccc(CN(Cc2ccc(C(O)=O)c(F)c2)C(=O)c2ccc(Oc3ccccc3F)cc2)c1