Reaction Details
TargetLysophosphatidic acid receptor 5
LigandBDBM251728
Substrate/Competitorn/a
Meas. Tech.Receptor Assay
Temperature310.15±n/a K
IC50 7±n/a nM
Commentsextracted
Citation Buffham, WCanning, HDavenport, RFarnaby, WMack, SParmar, AWright, S Compounds US Patent US9464060 Publication Date 10/11/2016
 
Lysophosphatidic acid receptor 5
Name:Lysophosphatidic acid receptor 5
Type:Enzyme
Mol. Mass.:41372.36
Organism:Homo sapiens (Human)
Description:Q9H1C0
Residue:372
BDBM251728
NameBDBM251728
Synonyms:US10100018, Example 64 | US9464060, 64
TypeSmall organic molecule
Emp. Form.C25H22F3NO5
Mol. Mass.473.4411
SMILESCOc1ccccc1Oc1ccc(cc1)C(=O)N(CCC(F)(F)F)Cc1ccc(cc1)C(O)=O