Reaction Details
TargetLysophosphatidic acid receptor 5
LigandBDBM251739
Substrate/Competitorn/a
Meas. Tech.Receptor Assay
Temperature310.15±n/a K
IC50 22±n/a nM
Commentsextracted
Citation Buffham, WCanning, HDavenport, RFarnaby, WMack, SParmar, AWright, S Compounds US Patent US9464060 Publication Date 10/11/2016
 
Lysophosphatidic acid receptor 5
Name:Lysophosphatidic acid receptor 5
Type:Enzyme
Mol. Mass.:41372.36
Organism:Homo sapiens (Human)
Description:Q9H1C0
Residue:372
BDBM251739
NameBDBM251739
Synonyms:US10100018, Example 75 | US9464060, 75
TypeSmall organic molecule
Emp. Form.C25H24FNO4
Mol. Mass.421.4608
SMILESCCCCN(Cc1ccc(cc1)C(O)=O)C(=O)c1ccc(Oc2ccccc2F)cc1