Reaction Details
TargetRho-associated protein kinase 1
LigandBDBM251935
Substrate/Competitorn/a
Meas. Tech.In Vitro Assay
pH7.5±n/a
IC50 1.11±n/a nM
Commentsextracted
Citation Quan, MLHu, ZWang, CGlunz, PW Phenylpyrazole derivatives as potent ROCK1 and ROCK2 inhibitors US Patent US9458110 Publication Date 10/4/2016
 
Rho-associated protein kinase 1
Name:Rho-associated protein kinase 1
Type:Serine/threonine-protein kinase
Mol. Mass.:158156.77
Organism:Homo sapiens (Human)
Description:Q13464
Residue:1354
BDBM251935
NameBDBM251935
Synonyms:US9458110, 7
TypeSmall organic molecule
Emp. Form.C20H21N3O3
Mol. Mass.351.399
SMILESCOc1cccc(c1)[C@@H](C)NC(=O)c1ccc(-c2cn[nH]c2)c(OC)c1