Reaction Details
TargetRho-associated protein kinase 1
LigandBDBM252160
Substrate/Competitorn/a
Meas. Tech.In Vitro Assay
pH7.5±n/a
IC50 1.04±n/a nM
Commentsextracted
Citation Quan, MLHu, ZWang, CGlunz, PW Phenylpyrazole derivatives as potent ROCK1 and ROCK2 inhibitors US Patent US9458110 Publication Date 10/4/2016
 
Rho-associated protein kinase 1
Name:Rho-associated protein kinase 1
Type:Serine/threonine-protein kinase
Mol. Mass.:158156.77
Organism:Homo sapiens (Human)
Description:Q13464
Residue:1354
BDBM252160
NameBDBM252160
Synonyms:US9458110, 232
TypeSmall organic molecule
Emp. Form.C20H22N4O2
Mol. Mass.350.4143
SMILESCOc1cc(ccc1-c1cn[nH]c1)C(=O)NC(CN)Cc1ccccc1