Reaction Details
TargetRho-associated protein kinase 1
LigandBDBM252176
Substrate/Competitorn/a
Meas. Tech.In Vitro Assay
pH7.5±n/a
IC50 0.43±n/a nM
Commentsextracted
Citation Quan, MLHu, ZWang, CGlunz, PW Phenylpyrazole derivatives as potent ROCK1 and ROCK2 inhibitors US Patent US9458110 Publication Date 10/4/2016
 
Rho-associated protein kinase 1
Name:Rho-associated protein kinase 1
Type:Serine/threonine-protein kinase
Mol. Mass.:158156.77
Organism:Homo sapiens (Human)
Description:Q13464
Residue:1354
BDBM252176
NameBDBM252176
Synonyms:US9458110, 248
TypeSmall organic molecule
Emp. Form.C25H29N5O3
Mol. Mass.447.5295
SMILESCOc1cc(ccc1-c1cn[nH]c1)C(=O)NCc1cccc(c1)C(=O)NC1CCN(C)CC1