Reaction Details
TargetProthrombin
LigandBDBM252992
Substrate/Competitorn/a
Meas. Tech.In Vitro Assay
pH7.4±n/a
Ki 400±n/a nM
Commentsextracted
Citation Chobanian, HBiftu, TPio, BWu, Z Thrombin inhibitors US Patent US9469608 Publication Date 10/18/2016
 
Prothrombin
Name:Prothrombin
Type:Protein
Mol. Mass.:70029.57
Organism:Homo sapiens (Human)
Description:P00734
Residue:622
BDBM252992
NameBDBM252992
Synonyms:US9469608, 22-10
TypeSmall organic molecule
Emp. Form.C22H24ClN3O4S
Mol. Mass.461.962
SMILESNCc1ccc(Cl)cc1CNC(=O)[C@@H]1CCCN1C(=O)C1c2ccccc2CS1(=O)=O