Reaction Details
TargetProthrombin
LigandBDBM253001
Substrate/Competitorn/a
Meas. Tech.In Vitro Assay
pH7.4±n/a
Ki 100±n/a nM
Commentsextracted
Citation Chobanian, HBiftu, TPio, BWu, Z Thrombin inhibitors US Patent US9469608 Publication Date 10/18/2016
 
Prothrombin
Name:Prothrombin
Type:Protein
Mol. Mass.:70029.57
Organism:Homo sapiens (Human)
Description:P00734
Residue:622
BDBM253001
NameBDBM253001
Synonyms:US9469608, 29-9b
TypeSmall organic molecule
Emp. Form.C22H26ClN5O2
Mol. Mass.427.927
SMILESNCc1ccc(Cl)cc1CNC(=O)[C@@H]1CCCN1C(=O)[C@@]1(N)CCc2cccnc12