Reaction Details
TargetProthrombin
LigandBDBM253009
Substrate/Competitorn/a
Meas. Tech.In Vitro Assay
pH7.4±n/a
Ki 720±n/a nM
Commentsextracted
Citation Chobanian, HBiftu, TPio, BWu, Z Thrombin inhibitors US Patent US9469608 Publication Date 10/18/2016
 
Prothrombin
Name:Prothrombin
Type:Protein
Mol. Mass.:70029.57
Organism:Homo sapiens (Human)
Description:P00734
Residue:622
BDBM253009
NameBDBM253009
Synonyms:US9469608, 37-11a
TypeSmall organic molecule
Emp. Form.C19H26ClN3O3
Mol. Mass.379.881
SMILESCC1(C)C[C@@]1(O)C(=O)N1CCC[C@H]1C(=O)NCc1cc(Cl)ccc1CN