Reaction Details
TargetProthrombin
LigandBDBM253011
Substrate/Competitorn/a
Meas. Tech.In Vitro Assay
pH7.4±n/a
Ki 100±n/a nM
Commentsextracted
Citation Chobanian, HBiftu, TPio, BWu, Z Thrombin inhibitors US Patent US9469608 Publication Date 10/18/2016
 
Prothrombin
Name:Prothrombin
Type:Protein
Mol. Mass.:70029.57
Organism:Homo sapiens (Human)
Description:P00734
Residue:622
BDBM253011
NameBDBM253011
Synonyms:US9469608, 38-4
TypeSmall organic molecule
Emp. Form.C18H24ClN3O3
Mol. Mass.365.854
SMILESNCc1ccc(Cl)cc1CNC(=O)[C@@H]1CCCN1C(=O)[C@H]1CCCO1