Reaction Details
TargetProthrombin
LigandBDBM253014
Substrate/Competitorn/a
Meas. Tech.In Vitro Assay
pH7.4±n/a
Ki 260±n/a nM
Commentsextracted
Citation Chobanian, HBiftu, TPio, BWu, Z Thrombin inhibitors US Patent US9469608 Publication Date 10/18/2016
 
Prothrombin
Name:Prothrombin
Type:Protein
Mol. Mass.:70029.57
Organism:Homo sapiens (Human)
Description:P00734
Residue:622
BDBM253014
NameBDBM253014
Synonyms:US9469608, 42-3
TypeSmall organic molecule
Emp. Form.C18H20ClN5O2
Mol. Mass.373.837
SMILESNCc1ccc(Cl)cc1CNC(=O)[C@@H]1CCCN1C(=O)c1ncccn1