Reaction Details
TargetKappa-type opioid receptor
LigandBDBM50090731
Substrate/Competitorn/a
Meas. Tech.Ligand Binding Assay
pH7.4±n/a
Ki 0.04±n/a nM
Commentsextracted
Citation Lewis, JHusbands, S Orvinol and thevinol derivatives useful in the treatment of anxiety or a compulsive disorder US Patent US9480684 Publication Date 11/1/2016
 
Kappa-type opioid receptor
Name:Kappa-type opioid receptor
Type:G Protein-Coupled Receptor (GPCR)
Mol. Mass.:42648.76
Organism:Homo sapiens (Human)
Description:P41145
Residue:380
BDBM50090731
NameBDBM50090731
Synonyms:CHEMBL3581741 US9480684, 22, R = 3- MePh- BU10112
TypeSmall organic molecule
Emp. Form.C32H37NO4
Mol. Mass.499.6405
SMILES[H][C@@]12Oc3c4c(C[C@@]5([H])N(CC6CC6)CC[C@@]14[C@]51C[C@](C)([C@H](O)c4cccc(C)c4)[C@]2(OC)C=C1)ccc3O