Reaction Details
TargetCholinesterase
LigandBDBM294222
Substrate/Competitorn/a
Meas. Tech.Enzyme Assay
IC50 24700±n/a nM
Citation Gulcan, HOUnlu, SEsiringu, ISahin, YErcetin, TOz, DSahin, F 1-(dimethylamino)ethyl-substituted 6H-benzo[C]chromen-6-ones against senile dementia US Patent US9586925 Publication Date 3/7/2017
 
Cholinesterase
Name:Cholinesterase
Type:Homotetramer
Mol. Mass.:68422.27
Organism:Homo sapiens (Human)
Description:P06276
Residue:602
BDBM294222
NameBDBM294222
Synonyms:(±)-1-(1-(dimethylamino)ethyl)-3-methoxy-6H-benzo[c]chromen-6-one US9586925, EXAMPLE XIII
TypeSmall organic molecule
Emp. Form.C18H19NO3
Mol. Mass.297.3484
SMILESCOc1cc(C(C)N(C)C)c2c(c1)oc(=O)c1ccccc21