Reaction Details
TargetAcetylcholinesterase
LigandBDBM294223
Substrate/Competitorn/a
Meas. Tech.Enzyme Assay
IC50 18900±n/a nM
Citation Gulcan, HOUnlu, SEsiringu, ISahin, YErcetin, TOz, DSahin, F 1-(dimethylamino)ethyl-substituted 6H-benzo[C]chromen-6-ones against senile dementia US Patent US9586925 Publication Date 3/7/2017
 
Acetylcholinesterase
Name:Acetylcholinesterase
Type:Enzyme
Mol. Mass.:67792.70
Organism:Homo sapiens (Human)
Description:P22303
Residue:614
BDBM294223
NameBDBM294223
Synonyms:(±)-3-(1-(dimethylamino)ethyl)-1-hydroxy-6H-benzo[c]chromen-6-one US9586925, EXAMPLE XV
TypeSmall organic molecule
Emp. Form.C17H17NO3
Mol. Mass.283.3218
SMILESCC(N(C)C)c1cc(O)c2c(c1)oc(=O)c1ccccc21