Reaction Details
TargetCytochrome P450 2C8
LigandBDBM253988
Substrate/Competitorn/a
Meas. Tech.Inhibition Assays
IC50 300±n/a nM
Citation Reiser, U 6-alkynyl-pyridine derivatives US Patent US9481673 Publication Date 11/1/2016
 
Cytochrome P450 2C8
Name:Cytochrome P450 2C8
Type:Protein
Mol. Mass.:55839.23
Organism:Homo sapiens (Human)
Description:P10632
Residue:490
BDBM253988
NameBDBM253988
Synonyms:US9481673, 82
TypeSmall organic molecule
Emp. Form.C33H27N7O2
Mol. Mass.553.6132
SMILESCNC(C)C(=O)Nc1ccc(-c2c(nc3cc(C)ccn23)-c2ccncc2)c(n1)C#Cc1ccc(cc1)-c1ccon1