Reaction Details
TargetBaculoviral IAP repeat-containing protein 2 [256-363]
LigandBDBM253994
Substrate/Competitorn/a
Meas. Tech.Binding Assays (DELFIA)
Temperature298.15±n/a K
IC50 1±n/a nM
Commentsextracted
Citation Reiser, U 6-alkynyl-pyridine derivatives US Patent US9481673 Publication Date 11/1/2016
 
Baculoviral IAP repeat-containing protein 2 [256-363]
Name:Baculoviral IAP repeat-containing protein 2 [256-363]
Type:Enzyme
Mol. Mass.:12600.71
Organism:Homo sapiens (Human)
Description:Human cIAP BIR3 domain (256-363 aa)
Residue:108
BDBM253994
NameBDBM253994
Synonyms:US9481673, (S)-4
TypeSmall organic molecule
Emp. Form.C33H30N8O
Mol. Mass.554.6443
SMILESCN[C@@H](C)C(=O)Nc1ccc(-c2c(nc3cc(C)ccn23)-c2cncn2C)c(n1)C#Cc1ccc2c(C)nccc2c1