Reaction Details
TargetBaculoviral IAP repeat-containing protein 2 [256-363]
LigandBDBM254005
Substrate/Competitorn/a
Meas. Tech.Binding Assays (DELFIA)
Temperature298.15±n/a K
IC50 2±n/a nM
Commentsextracted
Citation Reiser, U 6-alkynyl-pyridine derivatives US Patent US9481673 Publication Date 11/1/2016
 
Baculoviral IAP repeat-containing protein 2 [256-363]
Name:Baculoviral IAP repeat-containing protein 2 [256-363]
Type:Enzyme
Mol. Mass.:12600.71
Organism:Homo sapiens (Human)
Description:Human cIAP BIR3 domain (256-363 aa)
Residue:108
BDBM254005
NameBDBM254005
Synonyms:US9481673, (S)-15
TypeSmall organic molecule
Emp. Form.C34H28ClN7O2
Mol. Mass.602.085
SMILESCN[C@@H](C)C(=O)Nc1ccc(-c2c(nc3cc(Cl)ccn23)-c2cccnc2OC)c(n1)C#Cc1ccc2c(C)nccc2c1