Reaction Details
TargetCytochrome P450 2C8
LigandBDBM253992
Substrate/Competitorn/a
Meas. Tech.Inhibition Assays
IC50 900±n/a nM
Citation Reiser, U 6-alkynyl-pyridine derivatives US Patent US9481673 Publication Date 11/1/2016
 
Cytochrome P450 2C8
Name:Cytochrome P450 2C8
Type:Protein
Mol. Mass.:55839.23
Organism:Homo sapiens (Human)
Description:P10632
Residue:490
BDBM253992
NameBDBM253992
Synonyms:US9481673, (S)-2
TypeSmall organic molecule
Emp. Form.C35H31N7O
Mol. Mass.565.6669
SMILESCN[C@@H](C)C(=O)Nc1ccc(-c2c(nc3cc(C)ccn23)-c2ccnc(C)c2)c(n1)C#Cc1ccc2c(C)nccc2c1