Reaction Details
TargetSodium channel protein type 9 subunit alpha
LigandBDBM50169429
Substrate/Competitorn/a
Meas. Tech.Electrophysiological Assay (In vitro Assay)
IC50 222±n/a nM
Citation Liu, SFocken, TChahal, NZhang, ZOballa, RMFonarev, J Biaryl ether sulfonamides and their use as therapeutic agents US Patent US9481677 Publication Date 11/1/2016
 
Sodium channel protein type 9 subunit alpha
Name:Sodium channel protein type 9 subunit alpha
Type:Protein
Mol. Mass.:226375.97
Organism:Homo sapiens (Human)
Description:Q15858
Residue:1988
BDBM50169429
NameBDBM50169429
Synonyms:CHEMBL3805199 | US9481677, 32
TypeSmall organic molecule
Emp. Form.C20H15ClF2N6O3S2
Mol. Mass.524.951
SMILESFc1cc(c(F)cc1Oc1ccc(Cl)cc1-c1cnc2CNCCn12)S(=O)(=O)Nc1ncns1