Reaction Details
TargetSodium channel protein type 9 subunit alpha
LigandBDBM254116
Substrate/Competitorn/a
Meas. Tech.Electrophysiological Assay (In vitro Assay)
IC50 1.4±n/a nM
Citation Liu, SFocken, TChahal, NZhang, ZOballa, RMFonarev, J Biaryl ether sulfonamides and their use as therapeutic agents US Patent US9481677 Publication Date 11/1/2016
 
Sodium channel protein type 9 subunit alpha
Name:Sodium channel protein type 9 subunit alpha
Type:Protein
Mol. Mass.:226375.97
Organism:Homo sapiens (Human)
Description:Q15858
Residue:1988
BDBM254116
NameBDBM254116
Synonyms:US9481677, 54
TypeSmall organic molecule
Emp. Form.C22H11ClF5N5O3S2
Mol. Mass.587.929
SMILESFc1cc(c(F)cc1Oc1ccc(Cl)cc1-c1ccc2[nH]c(nc2c1)C(F)(F)F)S(=O)(=O)Nc1ncns1