Reaction Details
TargetSodium channel protein type 9 subunit alpha
LigandBDBM254118
Substrate/Competitorn/a
Meas. Tech.Electrophysiological Assay (In vitro Assay)
IC50 1.4±n/a nM
Citation Liu, SFocken, TChahal, NZhang, ZOballa, RMFonarev, J Biaryl ether sulfonamides and their use as therapeutic agents US Patent US9481677 Publication Date 11/1/2016
 
Sodium channel protein type 9 subunit alpha
Name:Sodium channel protein type 9 subunit alpha
Type:Protein
Mol. Mass.:226375.97
Organism:Homo sapiens (Human)
Description:Q15858
Residue:1988
BDBM254118
NameBDBM254118
Synonyms:US9481677, 56
TypeSmall organic molecule
Emp. Form.C21H12ClF2N5O4S2
Mol. Mass.535.931
SMILESNc1nc2cc(ccc2o1)-c1cc(Cl)ccc1Oc1cc(F)c(cc1F)S(=O)(=O)Nc1ncns1