Reaction Details
TargetSodium channel protein type 9 subunit alpha
LigandBDBM50169426
Substrate/Competitorn/a
Meas. Tech.Electrophysiological Assay (In vitro Assay)
IC50 0.5±n/a nM
Citation Liu, SFocken, TChahal, NZhang, ZOballa, RMFonarev, J Biaryl ether sulfonamides and their use as therapeutic agents US Patent US9481677 Publication Date 11/1/2016
 
Sodium channel protein type 9 subunit alpha
Name:Sodium channel protein type 9 subunit alpha
Type:Protein
Mol. Mass.:226375.97
Organism:Homo sapiens (Human)
Description:Q15858
Residue:1988
BDBM50169426
NameBDBM50169426
Synonyms:CHEMBL3806065 | US9481677, 69
TypeSmall organic molecule
Emp. Form.C22H14ClF2N5O4S2
Mol. Mass.549.957
SMILESCNc1noc2ccc(cc12)-c1cc(Cl)ccc1Oc1cc(F)c(cc1F)S(=O)(=O)Nc1ncns1