Reaction Details
TargetApoptosis regulator Bcl-2/Glutathione S-transferase P
LigandBDBM185618
Substrate/Competitorn/a
Meas. Tech.Time Resolved-Fluorescence Resonance Energy Transfer (TR-FRET) Assay
Temperature298.15±n/a K
Ki 339.986±n/a nM
Commentsextracted
Citation Kunzer, ARElmore, SWSullivan, GM Apoptosis-inducing agent for the treatment of cancer and immune and autoimmune diseases US Patent US9493431 Publication Date 11/15/2016
 
Apoptosis regulator Bcl-2/Glutathione S-transferase P
Name:Apoptosis regulator Bcl-2/Glutathione S-transferase P
Synonyms:GST-Bcl-2 Protein
Type:Protein
Mol. Mass.:n/a
Description:n/a
Components:This complex has 2 components.
Component 1
Name:Apoptosis regulator Bcl-2
Type:Homodimer or heterodimer
Mol. Mass.:26269.11
Organism:Homo sapiens (Human)
Description:P10415
Residue:239
Component 2
Name:Glutathione S-transferase P
Synonyms:FAEES3 GST3 GSTP1-1 Glutathione S-transferase Glutathione S-transferase P Glutathione transferase (GST)
Type:Enzyme
Mol. Mass.:23353.53
Organism:Homo sapiens (Human)
Description:P09211
Residue:210
BDBM185618
NameBDBM185618
Synonyms:US9156856, 29 | US9493431, 29
TypeSmall organic molecule
Emp. Form.C29H29Cl2N5O3S
Mol. Mass.598.543
SMILESCc1nn(C)c(Cl)c1S(=O)(=O)NC(=O)c1ccc(cc1)N1CCN(Cc2ccccc2-c2ccc(Cl)cc2)CC1