Reaction Details
TargetMembrane primary amine oxidase
LigandBDBM103940
Substrate/Competitorn/a
Meas. Tech.Biological Assay
pH7.4±n/a
IC50 34±0.0 nM
Commentsextracted
Citation Savory, EHigginbottom, MOliver, KHorgan, VA 4,5,6,7-tetrahyroimidazo[4,5-c]pyridine compounds US Patent US9493457 Publication Date 11/15/2016
 
Membrane primary amine oxidase
Name:Membrane primary amine oxidase
Type:Protein
Mol. Mass.:84620.86
Organism:Homo sapiens (Human)
Description:Q16853
Residue:763
BDBM103940
NameBDBM103940
Synonyms:US10399973, Example 7 US9035066, 7 US9890160, Example 7
TypeSmall organic molecule
Emp. Form.C16H20N4O2
Mol. Mass.300.3556
SMILESCC(C)C1N(CCc2nc[nH]c12)C(=O)OCc1cccnc1