Reaction Details
TargetP2X purinoceptor 7
LigandBDBM254319
Substrate/Competitorn/a
Meas. Tech.Radioligand Binding Assay
Ki 2.5±n/a nM
Citation Alcazar Vaca, MJAndres Gil, JIChrovian, CCCoate, HRDe Angelis, MDvorak, CAGelin, CFLetavic, MASavall, BMSoyode-Johnson, AStenne, BMSwanson, DM P2X7 modulators US Patent US9464084 Publication Date 10/11/2016
 
P2X purinoceptor 7
Name:P2X purinoceptor 7
Type:Protein
Mol. Mass.:68602.85
Organism:Homo sapiens (Human)
Description:Q99572
Residue:595
BDBM254319
NameBDBM254319
Synonyms:US10112937, Example 218 US10703749, Example 218 | US9464084, 218
TypeSmall organic molecule
Emp. Form.C17H12Cl2F2N6O
Mol. Mass.425.22
SMILESC[C@H]1Cc2c(CN1C(=O)c1ccc(Cl)c(F)c1Cl)nnn2-c1ncc(F)cn1