Reaction Details
TargetComplement factor D
LigandBDBM254488
Substrate/Competitorn/a
Meas. Tech.Human Complement Factor D Assay
pH7.5±n/a
Temperature298.15±n/a K
IC50 4±n/a nM
Commentsextracted
Citation Altmann, EHommel, ULorthiois, ELMaibaum, JKOstermann, NQuancard, JRandl, SARogel, OVulpetti, A Pyrrolidine derivatives and their use as complement pathway modulators US Patent US9468661 Publication Date 10/18/2016
 
Complement factor D
Name:Complement factor D
Type:Protein
Mol. Mass.:27039.19
Organism:Homo sapiens (Human)
Description:P00746
Residue:253
BDBM254488
NameBDBM254488
Synonyms:US9468661, 66
TypeSmall organic molecule
Emp. Form.C27H30Cl2N6O4
Mol. Mass.573.471
SMILESC[C@@H](NC(=O)[C@@H]1C[C@H]2C[C@H]2N1C(=O)Cn1nc(C(C)=O)c2cc(OCc3ccn(C)n3)ccc12)[C@H]1CC1(Cl)Cl