Reaction Details
TargetComplement factor D
LigandBDBM254498
Substrate/Competitorn/a
Meas. Tech.Human Complement Factor D Assay
pH7.5±n/a
Temperature298.15±n/a K
IC50 3±n/a nM
Commentsextracted
Citation Altmann, EHommel, ULorthiois, ELMaibaum, JKOstermann, NQuancard, JRandl, SARogel, OVulpetti, A Pyrrolidine derivatives and their use as complement pathway modulators US Patent US9468661 Publication Date 10/18/2016
 
Complement factor D
Name:Complement factor D
Type:Protein
Mol. Mass.:27039.19
Organism:Homo sapiens (Human)
Description:P00746
Residue:253
BDBM254498
NameBDBM254498
Synonyms:US9468661, 109 | US9468661, 76
TypeSmall organic molecule
Emp. Form.C27H28Cl2N6O4
Mol. Mass.571.455
SMILESCC1[C@@H](CNC(=O)[C@@H]2C[C@H]3C[C@H]3N2C(=O)Cn2nc(C(C)=O)c3cc(OCc4ncccn4)ccc23)C1(Cl)Cl