Reaction Details
TargetComplement factor D
LigandBDBM254528
Substrate/Competitorn/a
Meas. Tech.Human Complement Factor D Assay
pH7.5±n/a
Temperature298.15±n/a K
IC50 5±n/a nM
Commentsextracted
Citation Altmann, EHommel, ULorthiois, ELMaibaum, JKOstermann, NQuancard, JRandl, SARogel, OVulpetti, A Pyrrolidine derivatives and their use as complement pathway modulators US Patent US9468661 Publication Date 10/18/2016
 
Complement factor D
Name:Complement factor D
Type:Protein
Mol. Mass.:27039.19
Organism:Homo sapiens (Human)
Description:P00746
Residue:253
BDBM254528
NameBDBM254528
Synonyms:US9468661, 106
TypeSmall organic molecule
Emp. Form.C25H25Cl2N5O4S
Mol. Mass.562.468
SMILESCC(=O)c1nn(CC(=O)N2[C@@H]3C[C@@H]3C[C@H]2C(=O)NC[C@H]2CC2(Cl)Cl)c2ccc(OCc3nccs3)cc12