Reaction Details
TargetAmine oxidase [flavin-containing] A
LigandBDBM254553
Substrate/Competitorn/a
Meas. Tech.Fluorescence-Based (Inhibitor)-Screening Assay
pH7.5±n/a
Temperature310.15±n/a K
Ki 20000±n/a nM
Commentsextracted
Citation Ortega Muñoz, AFyfe, MCMartinell Pedemonte, MEstiarte Martínez, MValls Vidal, NKurz, GCastro Palomino Laria, JC (Hetero)aryl cyclopropylamine compounds as LSD1 inhibitors US Patent US9469597 Publication Date 10/18/2016
 
Amine oxidase [flavin-containing] A
Name:Amine oxidase [flavin-containing] A
Type:Protein
Mol. Mass.:59689.53
Organism:Homo sapiens (Human)
Description:P21397
Residue:527
BDBM254553
NameBDBM254553
Synonyms:US9469597, 12 | US9670136, 12 4-(((trans)-2-(6-(3-(trifluoromethyl)phenyl)pyridin-3-yl)cyclopropyl)amino)cyclohexanecarboxamide
TypeSmall organic molecule
Emp. Form.C22H24F3N3O
Mol. Mass.403.4407
SMILESNC(=O)C1CCC(CC1)N[C@H]1C[C@@H]1c1ccc(nc1)-c1cccc(c1)C(F)(F)F