Reaction Details
TargetProthrombin
LigandBDBM254888
Substrate/CompetitorBDBM254912
Meas. Tech.Inhibition Assay
pH7.4±n/a
Temperature295.15±n/a K
IC50 0.01±n/a nM
Commentsextracted
Citation Allerheiligen, SBuchmüller, AEngel, KGerdes, CGericke, KMGerisch, MHeitmeier, SHillisch, AKinzel, TLienau, PRiedl, BRöhrig, SSchmidt, MVStrassburger, JTersteegen, A Substituted benzoxazoles US Patent US9493472 Publication Date 11/15/2016
 
Prothrombin
Name:Prothrombin
Type:Protein
Mol. Mass.:70029.57
Organism:Homo sapiens (Human)
Description:P00734
Residue:622
BDBM254888
BDBM254912
NameBDBM254888
Synonyms:US9493472, 11
TypeSmall organic molecule
Emp. Form.C25H29ClFN3O5
Mol. Mass.505.966
SMILESCOc1cc(cc2nc(N[C@@H](CF)c3cccc(Cl)c3)oc12)C(=O)N1CC(C)(CCO)OC[C@H]1C