Reaction Details
TargetLeucine-rich repeat serine/threonine-protein kinase 2 [G2019S]
LigandBDBM254931
Substrate/Competitorn/a
Meas. Tech.Homogeneous Time Resolved-fluorescence Resonance Energy Transfer (TR-FRET) Assay
pH8.5±n/a
Temperature303.15±n/a K
IC50 2±n/a nM
Commentsextracted
Citation Bedford, STChen, IWang, YWilliamson, DS Arylpyrrolopyridine derived compounds as LRRK2 inhibitors US Patent US9499542 Publication Date 11/22/2016
 
Leucine-rich repeat serine/threonine-protein kinase 2 [G2019S]
Name:Leucine-rich repeat serine/threonine-protein kinase 2 [G2019S]
Type:n/a
Mol. Mass.:286143.23
Organism:Homo sapiens (Human)
Description:Q5S007(G2019S)
Residue:2527
BDBM254931
NameBDBM254931
Synonyms:US9499542, 14 | US9675594, 14
TypeSmall organic molecule
Emp. Form.C19H16N6
Mol. Mass.328.3705
SMILESCc1cccc(c1)-c1cc(Nc2ccn(C)n2)nc2[nH]cc(C#N)c12