Reaction Details
TargetMitogen-activated protein kinase kinase kinase 7/TGF-beta-activated kinase 1 and MAP3K7-binding protein 1
LigandBDBM254952
Substrate/Competitorn/a
Meas. Tech.Biological Assay
IC50 200±n/a nM
Citation Jacobsen, EJSpringer, JRBlinn, JRDevadas, B 4-alkoxy/aralkoxy-5-substituted-pyrrolopyrimidine compounds as TAK1 inhibitors in disease treatment US Patent US9505765 Publication Date 11/29/2016
 
Mitogen-activated protein kinase kinase kinase 7/TGF-beta-activated kinase 1 and MAP3K7-binding protein 1
Name:Mitogen-activated protein kinase kinase kinase 7/TGF-beta-activated kinase 1 and MAP3K7-binding protein 1
Type:n/a
Mol. Mass.:n/a
Description:ASSAY_ID of EBI is 739577
Components:This complex has 2 components.
Component 1
Name:TGF-beta-activated kinase 1 and MAP3K7-binding protein 1
Synonyms:MAP3K7IP1 TAB1 TAK1-binding protein 1 | TGF-beta-activated kinase 1-binding protein1
Type:Enzyme
Mol. Mass.:54633.89
Organism:Homo sapiens (Human)
Description:Q15750
Residue:504
Component 2
Name:Mitogen-activated protein kinase kinase kinase 7
Synonyms:M3K7_HUMAN Mitogen-activated protein kinase kinase kinase 7 TAK1/TAB1 Transforming growth factor-beta-activated kinase 1 (TAK1)
Type:Protein
Mol. Mass.:67199.89
Organism:Homo sapiens (Human)
Description:O43318
Residue:606
BDBM254952
NameBDBM254952
Synonyms:US9505765, 175
TypeSmall organic molecule
Emp. Form.C15H19N3O2
Mol. Mass.273.3303
SMILESCCC(=O)\C=C\c1c[nH]c2ncnc(OCC(C)C)c12