Reaction Details
TargetTyrosine-protein kinase JAK1
LigandBDBM255006
Substrate/Competitorn/a
Meas. Tech.Enzyme Assay
IC50 3.2±n/a nM
Citation Takahashi, KWatanabe, THayashi, KKurihara, KNakamura, TYamamoto, ANishimura, TKamiyama, THidaka, Y Tricyclic pyrrolopyridine compound, and JAK inhibitor US Patent US9475813 Publication Date 10/25/2016
 
Tyrosine-protein kinase JAK1
Name:Tyrosine-protein kinase JAK1
Type:Protein
Mol. Mass.:133293.73
Organism:Homo sapiens (Human)
Description:P23458
Residue:1154
BDBM255006
NameBDBM255006
Synonyms:US9475813, 11
TypeSmall organic molecule
Emp. Form.C20H23F3N6O
Mol. Mass.420.4314
SMILESFC(F)(F)CN1CN([C@H]2CC[C@H](CNCC#N)CC2)c2c(cnc3[nH]ccc23)C1=O